{"text_format":"1","workbook":"xlsx","n_sheets":15,"sheets":["START","Dane projektowe","Separacja","Dobór_kanałów_A","Dobór_kanałów_B","Dobór_kanałów_C","Dobór_kanałów_siatkowych","Dobór_rur","Schemat_szafy","separator","Kanały","Typy_kabli","Kable_sygnałowe","Kable_elektroenergetyczne","Szafy"],"not_rendered":{"charts":0,"images":0,"macros":1,"external_links":0,"defined_names":1,"comments":0,"pivot_tables":0},"unopened":[],"bounds":{"document_bytes":16777216,"sheet_cells":100000,"rows_first":2000,"rows_last":500,"rows_between":2000,"halvings":0,"cell_chars":16384,"cell_head_chars":4096},"cells_cut":0,"cells_raw":0,"read":"whole","date_system":"1900"}

{"sheet":"START","index":0,"n_rows":23,"n_cols":3,"rows_kept":23,"cut":false,"hidden":false,"merged":[[4,1,4,2]]}
[null,"Opracowanie: EMITER Sp. z o.o."]
[null,"Aktualna wersja do pobrania ze strony: "]
[null,"https://www.emiter.net.pl/do-pobrania/emiternet-tools.html"]
[]
[null,"Spis treści - linki do poszczególnych stron"," "]
[]
[null,"Dobór szacunkowej ilościu punktów abonenckich i kabli"]
[]
[null,"Dobór odstępu separacyjnego pomiędy okablowaniem informatycznym a okablowaniem energetycznym"]
[]
[null,"Dobór kanałów EmiterNet (metoda 1) - obliczenie liczby kabli w kanale"]
[]
[null,"Dobór kanałów EmiterNet (metoda 2) - wyszukanie rozmiaru kanału do podanej liczby kabli"]
[]
[null,"Dobór kanałów EmiterNet (metoda 3) - wyszukanie przykładowych kanałów wg 3 kryteriów"]
[]
[null,"Dobór kanałów siatkowych"]
[]
[null,"Dobór rur instalacyjnych"]
[]
{"$rows_left_out":4}
{"sheet":"Dane projektowe","index":1,"n_rows":33,"n_cols":7,"rows_kept":33,"cut":false,"hidden":false,"merged":[[3,1,3,2],[5,1,5,2]]}
[]
[]
[]
[null,"Dobór szacunkowej ilościu punktów abonenckich i kabli "]
[]
[null,"Poniższy dobór nie obejmuje wszyskich możliwości i stanowi jedynie wstępny punkt do dalszych rozważań projektowych"]
[]
[null,"Proszę wprowadzić odpowiednie dane","Edytować można tylko ciemnoszare pola"]
[]
[null,"Podaj kryterium do obliczeń","Wg podanej ilości punktów abonenckich",null,{"$f":"IFERROR(VLOOKUP(C10,Typy_kabli!A91:B92,2,FALSE),\"\")","v":2},null,"wybierz opcję"]
[]
[null,{"$f":"IF(E10=1,\"Podaj powierzchnię użytkową obiektu [m2]\",\"Podaj liczbę punktów abonenckiech (każdy 2xRJ45)\")","v":"Podaj liczbę punktów abonenckiech (każdy 2xRJ45)"},null,null,null,null,{"$f":"IF(E10=1,\"podaj wartość powierzchni\",\"podaj liczbę punktów abonenckich\")","v":"podaj liczbę punktów abonenckich"}]
[]
[null,"Podaj długość najkrótszego toru [m]",null,null,"kontrola wprowadzanych danych od 0-90m",null,"podaj wartość"]
[null,"Podaj długość najdłuższego toru [m]",null,null,null,null,"podaj wartość"]
[null,"Wybierz kryterium doboru liczby kabli",null,null,{"$f":"IFERROR(VLOOKUP(C16,Typy_kabli!A87:B89,2,FALSE),\"\")","v":""},{"$f":"IF(OR(C14=\"\",C15=\"\",C16=\"\"),\"\",IF(E16=1,(C14+C15)/2*0.66,IF(E16=2,(C14+C15)/2,(C14+C15)/2*1.33)))","v":""},"wybierz opcję"]
[null,"Średnia długość toru [m]",{"$f":"IF(F16=\"\",\"\",F16&\" m\")","v":""}]
[]
[null,"Typ wybranych paneli krosowych",null,null,{"$f":"IFERROR(VLOOKUP(C19,Typy_kabli!A94:B95,2,FALSE),\"\")","v":""},null,"wybierz opcję"]
[]
{"$rows_left_out":14}
{"sheet":"Separacja","index":2,"n_rows":56,"n_cols":11,"rows_kept":56,"cut":false,"hidden":false,"merged":[[5,1,5,2],[3,1,3,2],[7,1,7,2],[41,1,41,2]]}
[]
[]
[]
[null,"Separacja elektromagnetyczna"]
[]
[null,"Dobór odstępu separacyjnego pomiędy okablowaniem informatycznym, a okablowaniem energetycznym"]
[]
[null,"Poniższy dobór ma charket informacyjny. Opracowano na podstawie PN-EN 50174-2."]
[]
[null,"Proszę wprowadzić odpowiednie dane","Edytować można tylko ciemnoszare pola"]
[]
[null,"Rodzaj kabla/przewodu sygnałowego",null,null,{"$f":"IFERROR(VLOOKUP(C12,Typy_kabli!A3:G16,7,FALSE),\"\")","v":""},null,null,null,null,null,"wybierz opcję"]
[null,null,{"$f":"IFERROR(VLOOKUP(C12,Typy_kabli!A3:B16,2,FALSE),\"\")","v":""}]
[null,"Klasyfikacja rozdzielania kabla",{"$f":"IFERROR(VLOOKUP(C12,Typy_kabli!A3:G16,6,FALSE),\"\")","v":""}]
[]
[null,"Rodzaj kabla/przewodu elektroenergetycznego",null,null,{"$f":"IFERROR(VLOOKUP(C16,Typy_kabli!A72:B73,2,FALSE),\"\")","v":""},null,null,null,null,null,"wybierz opcję"]
[]
[null,"Obciążalność prądowa kabla/przewodu elektroenergetycznego",null,null,{"$f":"IFERROR(VLOOKUP(C18,Typy_kabli!A76:B82,2,FALSE),\"\")","v":""},{"$f":"E18/20","v":{"$error":"#VALUE!"}},null,null,null,null,"wybierz opcję"]
[]
[null,"Liczba kabli/przewodów elektroenergetycznych",null,null,{"$f":"IFERROR(VLOOKUP(C20,Typy_kabli!C52:D61,2,FALSE),\"\")","v":""},{"$f":"IFERROR(VLOOKUP(C20,Typy_kabli!C52:E61,3,FALSE),\"\")*E16*F18","v":{"$error":"#VALUE!"}},{"$f":"IF(F20>=90, 90,F20)","v":{"$error":"#VALUE!"}},{"$f":"IFERROR(VLOOKUP(G20,Typy_kabli!E52:E61,1,TRUE),\"\")","v":""},{"$f":"IF(G20>H20,1,0)","v":{"$error":"#VALUE!"}},{"$f":"INDEX(Typy_kabli!E52:E61,MATCH(H20,Typy_kabli!E52:E61,0)+I20,1)","v":{"$error":"#N/A"}},"wybierz opcję"]
{"$rows_left_out":37}
{"sheet":"Dobór_kanałów_A","index":3,"n_rows":43,"n_cols":7,"rows_kept":43,"cut":false,"hidden":false,"merged":[[5,1,5,2],[3,1,3,2]]}
[]
[]
[]
[null,"Dobór wypełnienia kanału EmiterNet PVC"]
[]
[null,"Wyliczenie szacunkowej ilości przewodów/kabli do wybranego wymiaru kanału PCV"]
[]
[null,"Proszę wprowadzić odpowiednie dane","Edytować można tylko ciemnoszare pola"]
[]
[null,"Typ wybranego kanału EmiterNet",null,null,null,null,"wybierz opcję"]
[]
[null,"Typ wybranego przewodu/kabla",null,null,null,null,"wybierz opcję"]
[]
[null,"Zapas wolnej przestrzeni na rozbudowę [%]",0.33,null,null,null,"podaj wartość"]
[null,"(zalecana wartość zapasu wolnej przestrzeni -> 33%)"]
[null,"Szerokość podstawy kanału [mm]",{"$f":"IFERROR(IF(E16<>\"\",E16&\" mm\",\"\"),\"\")","v":""},null,{"$f":"IFERROR(VLOOKUP(C10,Kanały!A3:J52,9,FALSE),\"\")","v":""}]
[null,"Wysokość kanału [mm]",{"$f":"IFERROR(IF(E17<>\"\",E17&\" mm\",\"\"),\"\")","v":""},null,{"$f":"IFERROR(VLOOKUP(C10,Kanały!A3:J52,10,FALSE),\"\")","v":""}]
[null,"Liczba sekcji w kanale (odseparowanych przestrzeni)",{"$f":"IFERROR(E18,\"\")","v":""},null,{"$f":"IFERROR(VLOOKUP(C10,Kanały!A3:J52,8,FALSE),\"\")","v":""}]
[null,"Powierzchnia użyteczna kanału (sumaryczna)",{"$f":"IFERROR(IF(E19<>\"\",E19&\" mm2\",\"\"),\"\")","v":""},null,{"$f":"IFERROR(ROUND(VLOOKUP(C10,Kanały!A3:J52,7,FALSE)/(1+C14),0),\"\")","v":""}]
[null,"Powierzchnia  użyteczna w cz.1",{"$f":"IFERROR(IF(E20<>\"\",E20&\" mm2\",\"\"),\"\")","v":""},null,{"$f":"IFERROR(ROUND(VLOOKUP(C10,Kanały!A3:J52,4,FALSE)/(1+C14),0),\"\")","v":""}]
{"$rows_left_out":24}
{"sheet":"Dobór_kanałów_B","index":4,"n_rows":38,"n_cols":14,"rows_kept":38,"cut":false,"hidden":false,"merged":[[3,1,3,2],[5,1,5,2]]}
[]
[]
[]
[null,"Dobór kanału EmiterNet PVC"]
[]
[null,"Dobór rozmiaru kanału PCV do układanej zakładanej liczby przewodów"]
[]
[null,"Proszę wprowadzić odpowiednie dane","Edytować można tylko ciemnoszare pola"]
[]
[null,"Typ układanego przewodu/kabla",null,null,null,null,null,null,null,null,null,null,null,"wybierz opcję"]
[]
[null,"Ilość przewodów/kabli",null,null,null,null,null,null,null,null,null,null,null,"podaj wartość"]
[]
[null,"Ilość sekcji w kanale (odseparowanych przestrzeni)",null,null,null,null,null,null,null,null,null,null,null,"wybierz opcję"]
[]
[null,"Zapas wolnej przestrzeni na rozbudowę",0.33,null,null,null,null,null,null,null,null,null,null,"podaj wartość"]
[null,"(zalecana wartość zapasu wolnej przestrzeni -> 33%)"]
[null,"Średnica wybranego przewodu/kabla",{"$f":"IFERROR(IF(E18<>\"\",E18&\" mm\",\"\"),\"\")","v":""},null,{"$f":"IFERROR(VLOOKUP(C10,Kable_sygnałowe!B3:D77,2,FALSE),\"\")","v":""}]
[null,"Przekrój użyteczny przewodu/kabla",{"$f":"IFERROR(IF(E19<>\"\",E19&\" mm2\",\"\"),\"\")","v":""},null,{"$f":"IFERROR(VLOOKUP(C10,Kable_sygnałowe!B3:D77,3,FALSE),\"\")","v":""}]
[null,{"$f":"IF(E20<>\"\",\"Minimalny promień gięcia podczas układania\",\"Zalecany minimalny promień gięcia\")","v":"Zalecany minimalny promień gięcia"},{"$f":"IFERROR(IF(E20<>\"\",E20&\" mm\",F20&\" mm\"),\"\")","v":""},null,{"$f":"IFERROR(VLOOKUP(C10,Typy_kabli!A3:I16,8,FALSE),\"\")","v":""},{"$f":"IF(E20=\"\",E18*8,\"\")","v":{"$error":"#VALUE!"}}]
{"$rows_left_out":19}
{"sheet":"Dobór_kanałów_C","index":5,"n_rows":44,"n_cols":14,"rows_kept":44,"cut":false,"hidden":false,"merged":[[5,1,5,2],[3,1,3,2]]}
[]
[]
[]
[null,"Dobór kanału EmiterNet PVC"]
[]
[null,"Dobór rozmiaru kanału PCV do układanej zakładanej liczby przewodów"]
[]
[null,"Proszę wprowadzić odpowiednie dane","Edytować można tylko ciemnoszare pola"]
[]
[null,"Typ układanego przewodu/kabla",null,null,null,null,null,null,null,null,null,null,null,"wybierz opcję"]
[]
[null,"Ilość przewodów/kabli",null,null,null,null,null,null,null,null,null,null,null,"podaj wartość"]
[]
[null,"Zapas wolnej przestrzeni na rozbudowę",0.33,null,null,null,null,null,null,null,null,null,null,"podaj wartość"]
[null,"(zalecana wartość zapasu wolnej przestrzeni -> 33%)"]
[null,"Średnica wybranego przewodu/kabla",{"$f":"IFERROR(IF(E16<>\"\",E16&\" mm\",\"\"),\"\")","v":""},null,{"$f":"IFERROR(VLOOKUP(C10,Kable_sygnałowe!B3:D77,2,FALSE),\"\")","v":""}]
[null,"Przekrój użyteczny przewodu/kabla",{"$f":"IFERROR(IF(E17<>\"\",E17&\" mm2\",\"\"),\"\")","v":""},null,{"$f":"IFERROR(VLOOKUP(C10,Kable_sygnałowe!B3:D77,3,FALSE),\"\")","v":""}]
[null,{"$f":"IF(E18<>\"\",\"Minimalny promień gięcia podczas układania\",\"Zalecany minimalny promień gięcia\")","v":"Zalecany minimalny promień gięcia"},{"$f":"IFERROR(IF(E18<>\"\",E18&\" mm\",F18&\" mm\"),\"\")","v":""},null,{"$f":"IFERROR(VLOOKUP(C10,Typy_kabli!A3:I16,8,FALSE),\"\")","v":""},{"$f":"IF(E18=\"\",E16*8,\"\")","v":{"$error":"#VALUE!"}}]
[null,{"$f":"IF(E19<>\"\",\"Minimalny promień gięcia podczas eksploatacji\",\"\")","v":""},{"$f":"IF(E19<>\"\",E19&\" mm\",\"\")","v":""},null,{"$f":"IFERROR(VLOOKUP(C10,Typy_kabli!A3:I16,9,FALSE),\"\")","v":""}]
[]
{"$rows_left_out":25}
{"sheet":"Dobór_kanałów_siatkowych","index":6,"n_rows":38,"n_cols":7,"rows_kept":38,"cut":false,"hidden":false,"merged":[[5,1,5,2],[3,1,3,2]]}
[]
[]
[]
[null,"Dobór wypełnienia kanałów siatkowych/drabinkowych"]
[]
[null,"Wyliczenie szacunkowej ilości przewodów do wybranego wymiaru kanału siatkowego/drabinkowego"]
[]
[null,"Proszę wprowadzić odpowiednie dane","Edytować można tylko ciemnoszare pola"]
[]
[null,"Wymiar kanału siatkowego/drabinkowego - szerokość podstawy [mm]",null,null,null,null,"podaj wartość"]
[null,"Wymiar kanału siatkowego/drabinkowego - wysokość [mm]",null,null,null,null,"podaj wartość"]
[null,"(w przypadku drabinki podajemy planowaną wysokość kabli w stosie)"]
[null,"Odstęp pomiędzy prętami [mm]",null,null,null,null,"podaj wartość"]
[]
[null,"Typ wybranego przewodu",null,null,null,null,"wybierz opcję"]
[]
[null,"Zapas wolnej przestrzeni na rozbudowę [%]",0.33,null,null,null,"podaj wartość"]
[null,"(zalecana wartość zapasu wolnej przestrzeni -> 33%)"]
[]
[null,"Maksymalna dopuszczalna wysokość stosu kabli",{"$f":"IFERROR(IF(C13<>\"\",E20&\" mm\",\"\"),\"\")","v":""},null,{"$f":"ROUNDDOWN(150/(1+C13*0.0007),1)","v":150}]
{"$rows_left_out":19}
{"sheet":"Dobór_rur","index":7,"n_rows":31,"n_cols":7,"rows_kept":31,"cut":false,"hidden":false,"merged":[[3,1,3,2],[5,1,5,2]]}
[]
[]
[]
[null,"Dobór rur instalacyjnych"]
[]
[null,"Dobór średnicy rury PCV do wybranej liczby wciąganych przewodów"]
[]
[null,"Proszę wprowadzić odpowiednie dane","Edytować można tylko ciemnoszare pola"]
[]
[null,"Typ układanego przewodu/kabla",null,null,null,null,"wybierz opcję"]
[]
[null,"Liczba przewodów/kabli",null,null,null,null,"podaj wartość"]
[]
[null,"Możliwość rozbudowy - zapas liczby kabli [szt]",null,null,null,null,"podaj wartość w szt."]
[null,"(zalecana wartość zapasu wolnej przestrzeni -> 33% -> proszę wprowadzić ilościowo, nie procentowo)"]
[]
[null,"Średnica wybranego przewodu/kabla",{"$f":"IFERROR(IF(E17<>\"\",E17&\" mm\",\"\"),\"\")","v":""},null,{"$f":"IFERROR(VLOOKUP(C10,Kable_sygnałowe!B3:D77,2,FALSE),\"\")","v":""}]
[null,"Przekrój użyteczny przewodu/kabla",{"$f":"IFERROR(IF(E18<>\"\",E18&\" mm2\",\"\"),\"\")","v":""},null,{"$f":"IFERROR(VLOOKUP(C10,Kable_sygnałowe!B3:D77,3,FALSE),\"\")","v":""}]
[null,{"$f":"IF(E19<>\"\",\"Minimalny promień gięcia podczas układania\",\"Zalecany minimalny promień gięcia\")","v":"Zalecany minimalny promień gięcia"},{"$f":"IFERROR(IF(E19<>\"\",E19&\" mm\",F19&\" mm\"),\"\")","v":""},null,{"$f":"IFERROR(VLOOKUP(C10,Typy_kabli!A3:I16,8,FALSE),\"\")","v":""},{"$f":"IF(E19=\"\",E17*8,\"\")","v":{"$error":"#VALUE!"}}]
[null,{"$f":"IF(E20<>\"\",\"Minimalny promień gięcia podczas eksploatacji\",\"\")","v":""},{"$f":"IF(E20<>\"\",E20&\" mm\",\"\")","v":""},null,{"$f":"IFERROR(VLOOKUP(C10,Typy_kabli!A3:I16,9,FALSE),\"\")","v":""}]
{"$rows_left_out":12}
{"sheet":"Schemat_szafy","index":8,"n_rows":69,"n_cols":13,"rows_kept":69,"cut":false,"hidden":false,"merged":[[3,1,3,4]]}
[]
[]
[]
[null,"Schemat elewacji szafy"]
[]
[null,"Uproszczony sposób przygotowania schematu elewacji szafy"]
[]
[null,"Proszę wprowadzić odpowiednie dane",null,null,"Edytować można tylko ciemnoszare pola"]
[]
[null,"Proszę wybrać model szafy",null,null,"EM/AS6412X",null,null,null,"wybierz opcję"]
[null,"Nazwa",null,null,{"$f":"IFERROR(IF(E10<>\"\",VLOOKUP(E10,Szafy!A2:G54,2,FALSE),\"\"),\"\")","v":"Szafa wisząca niedzielona 19'' 12U gł.450mm, niezmontowana, RAL 7035"}]
[null,"Typ szafy",null,null,{"$f":"IFERROR(IF(E10<>\"\",VLOOKUP(E10,Szafy!A2:G54,3,FALSE),\"\"),\"\")","v":"wisząca"}]
[null,"Wymiary:"]
[null,"wysokość",null,null,{"$f":"IFERROR(IF(L14<>\"\",L14&\"U\",\"\"),\"\")","v":"12U"},null,null,null,null,null,null,{"$f":"IFERROR(IF(E10<>\"\",VLOOKUP(E10,Szafy!A2:G54,4,FALSE),\"\"),\"\")","v":12}]
[null,"szerokość",null,null,{"$f":"IFERROR(IF(L15<>\"\",L15&\" mm\",\"\"),\"\")","v":"600 mm"},null,null,null,null,null,null,{"$f":"IFERROR(IF(E10<>\"\",VLOOKUP(E10,Szafy!A2:G54,5,FALSE),\"\"),\"\")","v":600}]
[null,"głębokość",null,null,{"$f":"IFERROR(IF(L16<>\"\",L16&\" mm\",\"\"),\"\")","v":"450 mm"},null,null,null,null,null,null,{"$f":"IFERROR(IF(E10<>\"\",VLOOKUP(E10,Szafy!A2:G54,6,FALSE),\"\"),\"\")","v":450}]
[]
[null,null,null,null,"poniżej znajduje się obszar druku schematu szafy"]
[]
[null,null,"rys.",null,"Schemat elewacji szafy",null,null,null,null,null,"                     wprowadź numer rysunku"]
{"$rows_left_out":50}
{"sheet":"separator","index":9,"n_rows":0,"n_cols":0,"rows_kept":0,"cut":false,"hidden":true,"merged":[]}

{"sheet":"Kanały","index":10,"n_rows":304,"n_cols":12,"rows_kept":304,"cut":false,"hidden":true,"merged":[[0,0,0,6],[1,1,1,2],[1,3,1,5]]}
["PRZEKROJE UŻYTECZNE KANAŁÓW ELEKTROINSTALACYJNYCH"]
["Typ kanału elektroinstalacyjnego","max. średnica kabla w kanale [mm]",null,"przekrój użyteczny kanału [mm^2]",null,null,"suma","ilość sekcji","szerokość","wysokość","maks.sekcja","min.sekcja"]
["LS 15X10 Bi",6,null,60,null,null,{"$f":"D3+E3+F3","v":60},1,15,10,{"$f":"MAX(D3:F3)","v":60},{"$f":"MIN(D3:F3)","v":60}]
["LS 12x12 Bi",null,null,56,null,null,{"$f":"D4+E4+F4","v":56},1,12,12,{"$f":"MAX(D4:F4)","v":56},{"$f":"MIN(D4:F4)","v":56}]
["LS 17x15 Bi",10,null,98,null,null,98,1,17,15,98,98]
["LS 20x12 Bi",7,null,110,null,null,110,1,20,12,110,110]
["LS 25x12 Bi",7,null,155,null,null,155,1,25,12,155,155]
["LS 20x18 Bi",14,null,240,null,null,240,1,20,18,240,240]
["LS 25x18 Bi",14,null,324,null,null,324,1,25,18,324,324]
["LS 35x18 Bi",14,null,380,null,null,380,1,35,18,380,380]
["LS 35x18 Bi/P",14,null,190,190,null,380,2,35,18,190,190]
["LS 50x18 Bi/P",14,null,290,290,null,580,2,50,18,290,290]
["LS 60x18 Bi/2P",14,null,220,250,220,690,3,60,18,250,220]
["LS 40x25 Bi",20,null,730,null,null,730,1,40,25,730,730]
["LS 35x30 Bi",25,null,780,null,null,780,1,35,30,780,780]
["LS 50x30Bi/P",13,20,380,710,null,1090,2,50,30,710,380]
["LS 40x40 Bi",25,null,1010,null,null,1010,1,40,40,1010,1010]
["LS 60x40 Bi",25,null,1550,null,null,1550,1,60,40,1550,1550]
["LS 60x40 Bi/P",25,null,1050,500,null,1550,2,60,40,1050,500]
["KS 90x40 Bi",25,null,2170,null,null,2170,1,90,40,2170,2170]
{"$rows_left_out":285}
{"sheet":"Typy_kabli","index":11,"n_rows":95,"n_cols":9,"rows_kept":95,"cut":false,"hidden":true,"merged":[]}
["Typy kabli EmiterNet"]
["kod towaru","nazwa","kategoria ","typ","średnica [mm]","klasyfikacja rozdzielania","nr klas.rozdz.","promień gięcia przy układaniu","promień gięcia eksloatacja"]
["K/EMITERNET-UTP5EPVC-STD.","Kabel Emiter Net UTP (U/UTP) kat.5e 350 MHz, drut,  standard, szary","5E","U/UTP",4.7,"b",2,40,20]
["K/EMITERNET-UTP5EPVC.","Kabel Emiter Net UTP (U/UTP) kat.5e 350 MHz,drut 4 x 2 x 24 AWG","5E","U/UTP",5,"b",2,40,20]
["K/EMITERNET-UTP6PVC-STD.","Kabel Emiter Net UTP (U/UTP) kat. 6 450 MHz, drut, standard, PVC, szary",6,"U/UTP",6,"b",2,60,30]
["K/EMITERNET-UTP6LSOH.","Kabel Emiter Net UTP (U/UTP) kat. 6 450 MHz, drut 4 x 2 x 23 AWG,LS0H",6,"U/UTP",6.5,"b",2,65,35]
["K/EMITERNET-UTP6LS0HB2CA","Kabel Emiter Net U/UTP kat. 6 450 MHz B2ca LS0H, drut 4 x 2 x 23 AWG",6,"U/UTP",6.3,"b",2,63,35]
["K/EMITERNET-FTP5E.","Kabel Emiter Net FTP (F/UTP) kat. 5e 350 MHz, drut  4 x 2 x 24 AWG , PVC","5E","F/UTP",6,"c",3,50,25]
["K/EMITERNET-FTP6PVC-STD.","Kabel teleinformatyczny, FTP (F/UTP) kat.6 450 MHz, drut 4x2x23AWG, PVC",6,"F/UTP",7.5,"c",3,80,50]
["K/EMITERNET-FTP6LS0H.","Kabel Emiter Net FTP (F/UTP) kat 6 450 MHz, drut 4 x2 x 23AWG, LSZH-FR",6,"F/UTP",7.3,"c",3,80,50]
["K/EMITERNET-SFTP7LS0H.","Kabel Emiter Net SFTP (S/FTP) kat 7 1000MHz, drut 4 x2 x 23AWG, LSZH-FR",7,"S/FTP",7.5,"d",4,150,75]
["K/EMITERNET-SFTP7LS0HB2CA.","Kabel Emiter Net S/FTP kat 7 1000MHz B2ca LSZH-FR, drut 4 x2 x 23AWG",7,"S/FTP",8,"d",4,160,80]
["K/EMITERNET-UTP5EOutdoor.","Kabel  EmiterNet zewnętrzny PVC+PE UTP (U/UTP) kat.5e, drut 4x2x0,5 PE","5E","U/UTP",6.6,"b",2,70,35]
["K/EMITERNET-UTP5EOut-GEL.","Kabel EmiterNet zewnętrzny żelowany PE UTP (U/UTP) kat.5e, drut 4x2x0,5 PE+GEL","5E","U/UTP",5.2,"b",2,50,25]
["K/EMITERNET-FTP5EOut-GEL.","Kabel EmiterNet zewnętrzny żelowany PE FTP (F/UTP) kat.5e, drut 4x2x0,5 PE+GEL","5E","F/UTP",6.2,"c",3,60,30]
["K/EMITERNET-UTP6Out-GEL.","Kabel EmiterNet zewnętrzny żelowany PE UTP (U/UTP) kat.6 żel, drut 4x2x0,57 PE+GEL",6,"U/UTP",6.7,"b",2,60,30]
[]
[]
[]
[]
{"$rows_left_out":76}
{"sheet":"Kable_sygnałowe","index":12,"n_rows":78,"n_cols":4,"rows_kept":78,"cut":false,"hidden":true,"merged":[[34,0,77,0],[0,0,0,3],[16,0,24,0],[25,0,31,0],[32,0,33,0],[2,0,15,0]]}
["PRZEKROJE UŻYTECZNE KABLI SYGNAŁOWYCH"]
[null,"Typy kabli","Średnica zew. kabla [mm]","Przekrój użyteczny kabla [mm^2]"]
["kable EmiterNet",{"$f":"Typy_kabli!A3","v":"K/EMITERNET-UTP5EPVC-STD."},{"$f":"Typy_kabli!E3","v":4.7},{"$f":"ROUND(PI()*C3*C3/4*1.2732395,0)","v":22}]
[null,{"$f":"Typy_kabli!A4","v":"K/EMITERNET-UTP5EPVC."},{"$f":"Typy_kabli!E4","v":5},{"$f":"ROUND(PI()*C4*C4/4*1.2732395,0)","v":25}]
[null,{"$f":"Typy_kabli!A5","v":"K/EMITERNET-UTP6PVC-STD."},{"$f":"Typy_kabli!E5","v":6},36]
[null,{"$f":"Typy_kabli!A6","v":"K/EMITERNET-UTP6LSOH."},{"$f":"Typy_kabli!E6","v":6.5},42]
[null,{"$f":"Typy_kabli!A7","v":"K/EMITERNET-UTP6LS0HB2CA"},{"$f":"Typy_kabli!E7","v":6.3},40]
[null,{"$f":"Typy_kabli!A8","v":"K/EMITERNET-FTP5E."},{"$f":"Typy_kabli!E8","v":6},36]
[null,{"$f":"Typy_kabli!A9","v":"K/EMITERNET-FTP6PVC-STD."},{"$f":"Typy_kabli!E9","v":7.5},56]
[null,{"$f":"Typy_kabli!A10","v":"K/EMITERNET-FTP6LS0H."},{"$f":"Typy_kabli!E10","v":7.3},53]
[null,{"$f":"Typy_kabli!A11","v":"K/EMITERNET-SFTP7LS0H."},{"$f":"Typy_kabli!E11","v":7.5},56]
[null,{"$f":"Typy_kabli!A12","v":"K/EMITERNET-SFTP7LS0HB2CA."},{"$f":"Typy_kabli!E12","v":8},64]
[null,{"$f":"Typy_kabli!A13","v":"K/EMITERNET-UTP5EOutdoor."},{"$f":"Typy_kabli!E13","v":6.6},44]
[null,{"$f":"Typy_kabli!A14","v":"K/EMITERNET-UTP5EOut-GEL."},{"$f":"Typy_kabli!E14","v":5.2},27]
[null,{"$f":"Typy_kabli!A15","v":"K/EMITERNET-FTP5EOut-GEL."},{"$f":"Typy_kabli!E15","v":6.2},38]
[null,{"$f":"Typy_kabli!A16","v":"K/EMITERNET-UTP6Out-GEL."},{"$f":"Typy_kabli!E16","v":6.7},45]
["do instalacji alarmowych i przeciwpożarowych","YTDY 2 x 0,5",3,9]
[null,"YTDY 4 x 0,5",3,9]
[null,"YTDY 6 x 0,5",4,16]
[null,"YTDY 8 x 0,5",4,16]
{"$rows_left_out":59}
{"sheet":"Kable_elektroenergetyczne","index":13,"n_rows":13,"n_cols":17,"rows_kept":13,"cut":false,"hidden":true,"merged":[[0,0,0,10],[1,1,1,10],[2,0,3,0],[2,1,2,2],[2,3,2,4],[2,5,2,6],[2,7,2,8],[2,9,2,10]]}
["PRZEKROJE UŻYTECZNE KABLI ELEKTROENERGETYCZNYCH"]
[null,"Kabel typu YDY"]
["Przekrój poj. żyły w kablu [mm^2]","1-żyłowy",null,"2-żyłowy",null,"3-żyłowy",null,"4-żyłowy",null,"5-żyłowy"]
[null,"Średnica zew. Kabla [mm]","Przekrój użyt. kabla [mm^2]","Średnica zew. Kabla [mm]","Przekrój użyt. kabla [mm^2]","Średnica zew. Kabla [mm]","Przekrój użyt. kabla [mm^2]","Średnica zew. Kabla [mm]","Przekrój użyt. kabla [mm^2]","Średnica zew. kabla [mm]","Przekrój użyt. kabla [mm^2]"]
[1.5,6.6,44,10.5,111,11,121,12,144,13,169,null,{"$f":"C5/(PI()*B5*B5/4)","v":1.2861005502375382},null,{"$f":"E5/(PI()*D5*D5/4)","v":1.2819010382367624},null,{"$f":"G5/(PI()*F5*F5/4)","v":1.2732395447351628}]
[2.5,7,49,11.5,133,12.5,157,13,169,14.5,211,null,{"$f":"C6/(PI()*B6*B6/4)","v":1.2732395447351628},null,1.2804601848754378,null,1.2793510945498914]
[4,7.6,58,13,169,13.5,183,14.5,211,16,256,null,1.2785300137576081,null,1.2732395447351628,null,1.2784792136435379]
[6,8.1999999999999993,68,14,196,15,225,16,256,17.5,307,null,1.2876307115108727,null,1.2732395447351628,null,1.2732395447351628]
[10,9.1999999999999993,85,16,256,17,289,18.5,343,20,400,null,1.2786550248403692,null,1.2732395447351628,null,1.2732395447351625]
[16,10.5,111,18.5,245,19.5,381,21,441,23,529,null,1.2819010382367624,null,0.91144978366724572,null,1.2757508653362184]
[25,12.5,157,22,484,23.5,553,25.5,651,28,784,null,1.2793510945498914,null,1.2732395447351628,null,1.2749687066338524]
[35,13.5,183,24.5,601,26,676,28.5,813,31.5,993,null,1.2784792136435379,null,1.2748304312966812,null,1.2732395447351628]
[50,15,225,null,null,29,841,32.5,1057,null,null,null,1.2732395447351628,null,{"$error":"#DIV/0!"},null,1.2732395447351628]

{"sheet":"Szafy","index":14,"n_rows":104,"n_cols":7,"rows_kept":104,"cut":false,"hidden":true,"merged":[]}
["Kod szafy","Nazwa","typ","wysokość","szerokość","głębokość","opis skrócony"]
["EM/AS6406X","Szafa wisząca niedzielona 19'' 6U gł.450mm, niezmontowana, RAL 7035","wisząca",6,600,450,{"$f":" \" \"&D2&\"U \"&E2&\" x \"&F2&\" [mm]\"","v":" 6U 600 x 450 [mm]"}]
["EM/AS6409X","Szafa wisząca niedzielona 19'' 9U gł.450mm, niezmontowana, RAL 7035","wisząca",9,600,450,{"$f":" \" \"&D3&\"U \"&E3&\" x \"&F3&\" [mm]\"","v":" 9U 600 x 450 [mm]"}]
["EM/AS6412X","Szafa wisząca niedzielona 19'' 12U gł.450mm, niezmontowana, RAL 7035","wisząca",12,600,450," 12U 600 x 450 [mm]"]
["EM/AS6415X","Szafa wisząca niedzielona 19'' 15U gł.450mm, niezmontowana, RAL 7035","wisząca",15,600,450," 15U 600 x 450 [mm]"]
["EM/AS6418X","Szafa wisząca niedzielona 19'' 18U gł.450mm, niezmontowana, RAL 7035","wisząca",18,600,450," 18U 600 x 450 [mm]"]
["EM/AS6606X","Szafa wisząca niedzielona 19'' 6U gł.600mm, niezmontowana, RAL 7035","wisząca",6,600,600," 6U 600 x 600 [mm]"]
["EM/AS6609X","Szafa wisząca niedzielona 19'' 9U gł.600mm, niezmontowana, RAL 7035","wisząca",9,600,600," 9U 600 x 600 [mm]"]
["EM/AS6612X","Szafa wisząca niedzielona 19'' 12U gł.600mm, niezmontowana, RAL 7035","wisząca",12,600,600," 12U 600 x 600 [mm]"]
["EM/AS6615X","Szafa wisząca niedzielona 19'' 15U gł.600mm, niezmontowana, RAL 7035","wisząca",15,600,600," 15U 600 x 600 [mm]"]
["EM/SH02B5404-08","Szafa wisząca lekka niedzielona 19'' 4U, drzwi blacha/szkło, ściągane osłony boczne, 550×450×230 szer./gł./wys. mm; RAL: 9004,  w komplecie 10 śrub montażowych ","wisząca",4,550,450," 4U 550 x 450 [mm]"]
["EM/SH02B5406-08","Szafa wisząca lekka niedzielona 19'' 6U, drzwi blacha/szkło, ściągane osłony boczne, 550×450×320 szer./gł./wys. mm; RAL: 9004,  w komplecie 10 śrub montażowych ","wisząca",6,550,450," 6U 550 x 450 [mm]"]
["EM/SH02B5409-08","Szafa wisząca  lekka niedzielona 19'' 9U, drzwi blacha/szkło, ściągane osłony boczne, 550×450×455 szer./gł./wys. mm; RAL: 9004,  w komplecie 10 śrub montażowych ","wisząca",9,550,450," 9U 550 x 450 [mm]"]
["EM/SH02B5412-08","Szafa wisząca  lekka niedzielona 19'' 12U, drzwi blacha/szkło, ściągane osłony boczne, 550×450×590 szer./gł./wys. mm; RAL: 9004,  w komplecie 10 śrub montażowych ","wisząca",12,550,450," 12U 550 x 450 [mm]"]
["EM/AP6309-B","Szafa wisząca niedzielona 19'' 9U, drzwi całe z blachy, zamek, 600×300×500 szer./gł./wys. mm; RAL: 7044","wisząca",9,600,300," 9U 600 x 300 [mm]"]
["EM/AP6318-B","Szafa wisząca niedzielona 19'' 18U, drzwi całe z blachy, zamek, 600×300×910 szer./gł./wys. mm; RAL: 7044","wisząca",18,600,300," 18U 600 x 300 [mm]"]
["EM/AP6404","Szafa wisząca niedzielona 19'' 4U, drzwi blacha/szkło, ściągane osłony boczne z zamkiem,600×450×280 szer./gł./wys. mm; RAL: szafa 7044, drzwi 7010,  w komplecie półka stała 280mm i komplet 15 śrub montażowych ","wisząca",4,600,450," 4U 600 x 450 [mm]"]
["EM/AP6406","Szafa wisząca niedzielona 19'' 6U, drzwi blacha/szkło, ściągane osłony boczne z zamkiem,600×450×370 szer./gł./wys. mm; RAL: szafa 7044, drzwi 7010, , w komplecie półka stała 280mm i komplet 15 śrub montażowych ","wisząca",6,600,450," 6U 600 x 450 [mm]"]
["EM/AP6409","Szafa wisząca niedzielona 19'' 9U, drzwi blacha/szkło, ściągane osłony boczne z zamkiem, 600×450×500 szer./gł./wys. mm; RAL: szafa 7044, drzwi 7010, w komplecie półka stała 280mm i komplet 15 śrub montażowych","wisząca",9,600,450," 9U 600 x 450 [mm]"]
["EM/AP6412","Szafa wisząca niedzielona 19'' 12U, drzwi blacha/szkło, ściągane osłony boczne z zamkiem, 600×450×635 szer./gł./wys. mm; RAL: szafa 7044, drzwi 7010, w komplecie półka stała 280mm i komplet 15 śrub montażowych","wisząca",12,600,450," 12U 600 x 450 [mm]"]
{"$rows_left_out":84}